Information card for entry 4342719
Formula | C9 H13 F6 N2 O2 P Ru |
Calculated formula | C9 H13 F6 N2 O2 P Ru |
SMILES | [Ru]1234567(OC(=O)[C@@H]([NH2]1)C[NH2]2)[cH]1[cH]7[cH]6[cH]5[cH]4[cH]31.[P](F)(F)(F)(F)(F)[F-] |
Title of publication | Selective Lability of Ruthenium(II) Arene Amino Acid Complexes. |
Authors of publication | Scrase, Tom G.; O'Neill, Michael J; Peel, Andrew J.; Senior, Paul W.; Matthews, Peter D.; Shi, Heyao; Boss, Sally R.; Barker, Paul D. |
Journal of publication | Inorganic chemistry |
Year of publication | 2015 |
Journal volume | 54 |
Journal issue | 7 |
Pages of publication | 3118 - 3124 |
a | 6.3443 ± 0.0002 Å |
b | 9.3938 ± 0.0003 Å |
c | 11.9664 ± 0.0005 Å |
α | 98.943 ± 0.002° |
β | 104.227 ± 0.002° |
γ | 94.9 ± 0.002° |
Cell volume | 677.17 ± 0.04 Å3 |
Cell temperature | 180 ± 2 K |
Ambient diffraction temperature | 180 ± 2 K |
Number of distinct elements | 7 |
Space group number | 1 |
Hermann-Mauguin space group symbol | P 1 |
Hall space group symbol | P 1 |
Residual factor for all reflections | 0.0838 |
Residual factor for significantly intense reflections | 0.0456 |
Weighted residual factors for significantly intense reflections | 0.0924 |
Weighted residual factors for all reflections included in the refinement | 0.0972 |
Goodness-of-fit parameter for all reflections included in the refinement | 0.879 |
Diffraction radiation wavelength | 0.71073 Å |
Diffraction radiation type | MoKα |