Information card for entry 4342723
Formula | C11 H16 F6 N O2 P Ru S |
Calculated formula | C11 H16 F6 N O2 P Ru S |
SMILES | [Ru]1234567([S](CC[C@H]([NH2]1)C(=O)O2)C)[cH]1[cH]3[cH]4[cH]5[cH]6[cH]71.[P](F)(F)(F)(F)(F)[F-] |
Title of publication | Selective Lability of Ruthenium(II) Arene Amino Acid Complexes. |
Authors of publication | Scrase, Tom G.; O'Neill, Michael J; Peel, Andrew J.; Senior, Paul W.; Matthews, Peter D.; Shi, Heyao; Boss, Sally R.; Barker, Paul D. |
Journal of publication | Inorganic chemistry |
Year of publication | 2015 |
Journal volume | 54 |
Journal issue | 7 |
Pages of publication | 3118 - 3124 |
a | 6.028 ± 0.0001 Å |
b | 9.2549 ± 0.0002 Å |
c | 26.7467 ± 0.0006 Å |
α | 90° |
β | 90° |
γ | 90° |
Cell volume | 1492.16 ± 0.05 Å3 |
Cell temperature | 180 ± 2 K |
Ambient diffraction temperature | 180 ± 2 K |
Number of distinct elements | 8 |
Space group number | 19 |
Hermann-Mauguin space group symbol | P 21 21 21 |
Hall space group symbol | P 2ac 2ab |
Residual factor for all reflections | 0.0388 |
Residual factor for significantly intense reflections | 0.0314 |
Weighted residual factors for significantly intense reflections | 0.0761 |
Weighted residual factors for all reflections included in the refinement | 0.0774 |
Goodness-of-fit parameter for all reflections included in the refinement | 1.037 |
Diffraction radiation wavelength | 0.71073 Å |
Diffraction radiation type | MoKα |