Information card for entry 4342725
Formula | C19 H43 B18 Cl2 Co N2 O2 |
Calculated formula | C19 H43 B18 Cl2 Co N2 O2 |
SMILES | [Co]12345678([C]9%10%11([CH]%12%131[BH]1%14%11[BH]%11%15%10[BH]%1029[BH]294[BH]43%12[BH]3%13%14[BH]%121%15[BH]%11%102[BH]943%12)C12c3ccccc3C(=O)N1CCO2)[CH]123[CH]495[BH]5%103[BH]3%112[BH]261[BH]168[BH]874[BH]49%10[BH]75%11[BH]321[BH]6847.[N+](C)(C)(C)C.C(Cl)Cl |
Title of publication | The Synthesis and Structural Characterization of Polycyclic Derivatives of Cobalt Bis(dicarbollide)(1(-)). |
Authors of publication | Grüner, Bohumír; Šícha, Václav; Hnyk, Drahomír; Londesborough, Michael G. S.; Císařová, Ivana |
Journal of publication | Inorganic chemistry |
Year of publication | 2015 |
Journal volume | 54 |
Journal issue | 7 |
Pages of publication | 3148 - 3158 |
a | 8.8476 ± 0.0002 Å |
b | 12.041 ± 0.0003 Å |
c | 16.3218 ± 0.0004 Å |
α | 82.386 ± 0.001° |
β | 84.009 ± 0.001° |
γ | 72.56 ± 0.001° |
Cell volume | 1640.42 ± 0.07 Å3 |
Cell temperature | 150 ± 2 K |
Ambient diffraction temperature | 150 ± 2 K |
Number of distinct elements | 7 |
Space group number | 2 |
Hermann-Mauguin space group symbol | P -1 |
Hall space group symbol | -P 1 |
Residual factor for all reflections | 0.0513 |
Residual factor for significantly intense reflections | 0.0452 |
Weighted residual factors for significantly intense reflections | 0.1167 |
Weighted residual factors for all reflections included in the refinement | 0.1217 |
Goodness-of-fit parameter for all reflections included in the refinement | 1.031 |
Diffraction radiation wavelength | 0.71073 Å |
Diffraction radiation type | MoKα |