Information card for entry 4342728
Formula | C15 H33 B18 Co Li N O3 |
Calculated formula | C15 H33 B18 Co Li N O3 |
Title of publication | The Synthesis and Structural Characterization of Polycyclic Derivatives of Cobalt Bis(dicarbollide)(1(-)). |
Authors of publication | Grüner, Bohumír; Šícha, Václav; Hnyk, Drahomír; Londesborough, Michael G. S.; Císařová, Ivana |
Journal of publication | Inorganic chemistry |
Year of publication | 2015 |
Journal volume | 54 |
Journal issue | 7 |
Pages of publication | 3148 - 3158 |
a | 11.0702 ± 0.0004 Å |
b | 13.0078 ± 0.0004 Å |
c | 22.9231 ± 0.0009 Å |
α | 90° |
β | 97.445 ± 0.001° |
γ | 90° |
Cell volume | 3273.1 ± 0.2 Å3 |
Cell temperature | 150 ± 2 K |
Ambient diffraction temperature | 150 ± 2 K |
Number of distinct elements | 7 |
Space group number | 14 |
Hermann-Mauguin space group symbol | P 1 21/n 1 |
Hall space group symbol | -P 2yn |
Residual factor for all reflections | 0.0779 |
Residual factor for significantly intense reflections | 0.0624 |
Weighted residual factors for significantly intense reflections | 0.1605 |
Weighted residual factors for all reflections included in the refinement | 0.1693 |
Goodness-of-fit parameter for all reflections included in the refinement | 1.036 |
Diffraction radiation wavelength | 0.71073 Å |
Diffraction radiation type | MoKα |