Information card for entry 4342733
Formula | C38 H38 Fe N6 O3 Se2 |
Calculated formula | C38 H36 Fe N6 O3 Se2 |
Title of publication | Coligand and Solvent Effects on the Architectures and Spin-Crossover Properties of (4,4)-Connected Iron(II) Coordination Polymers. |
Authors of publication | Wu, Xue-Ru; Shi, Hai-Yan; Wei, Rong-Jia; Li, Jia; Zheng, Lan-Sun; Tao, Jun |
Journal of publication | Inorganic chemistry |
Year of publication | 2015 |
Journal volume | 54 |
Journal issue | 8 |
Pages of publication | 3773 - 3780 |
a | 22.11 ± 0.003 Å |
b | 13.6595 ± 0.0014 Å |
c | 15.0436 ± 0.0014 Å |
α | 90° |
β | 116.019 ± 0.01° |
γ | 90° |
Cell volume | 4082.9 ± 0.9 Å3 |
Cell temperature | 153 ± 2 K |
Ambient diffraction temperature | 153 ± 2 K |
Number of distinct elements | 6 |
Space group number | 15 |
Hermann-Mauguin space group symbol | C 1 2/c 1 |
Hall space group symbol | -C 2yc |
Residual factor for all reflections | 0.1103 |
Residual factor for significantly intense reflections | 0.0982 |
Weighted residual factors for significantly intense reflections | 0.2804 |
Weighted residual factors for all reflections included in the refinement | 0.2965 |
Goodness-of-fit parameter for all reflections included in the refinement | 1.047 |
Diffraction radiation wavelength | 1.54178 Å |
Diffraction radiation type | CuKα |