Information card for entry 4342738
Formula | C22 H16 N6 Pt S4 |
Calculated formula | C22 H16 N6 Pt S4 |
SMILES | [Pt]12([S]=C(S1)N(c1ncccc1)c1ncccc1)[S]=C(S2)N(c1ncccc1)c1ncccc1 |
Title of publication | Interpreting Effects of Structure Variations Induced by Temperature and Pressure on Luminescence Spectra of Platinum(II) Bis(dithiocarbamate) Compounds. |
Authors of publication | Poirier, Stéphanie; Roberts, Ryan J.; Le, Debbie; Leznoff, Daniel B.; Reber, Christian |
Journal of publication | Inorganic chemistry |
Year of publication | 2015 |
Journal volume | 54 |
Journal issue | 8 |
Pages of publication | 3728 - 3735 |
a | 14.908 ± 0.003 Å |
b | 11.805 ± 0.003 Å |
c | 14.952 ± 0.004 Å |
α | 90° |
β | 115.626 ± 0.003° |
γ | 90° |
Cell volume | 2372.6 ± 1 Å3 |
Cell temperature | 296 ± 2 K |
Ambient diffraction temperature | 296 ± 2 K |
Number of distinct elements | 5 |
Space group number | 14 |
Hermann-Mauguin space group symbol | P 1 21/n 1 |
Hall space group symbol | -P 2yn |
Residual factor for all reflections | 0.0949 |
Residual factor for significantly intense reflections | 0.0694 |
Weighted residual factors for significantly intense reflections | 0.1438 |
Weighted residual factors for all reflections included in the refinement | 0.1562 |
Goodness-of-fit parameter for all reflections included in the refinement | 1.092 |
Diffraction radiation wavelength | 0.71073 Å |
Diffraction radiation type | MoKα |