Information card for entry 4342740
Formula | C28 H37 B Cd F2 N6 O2 S3 |
Calculated formula | C28 H37 B Cd F2 N6 O2 S3 |
SMILES | [Cd]123([O]=C(O1)c1c(F)cccc1F)[S]=C1N([BH](N4C(=[S]2)N(C=C4)C(C)(C)C)N2C(=[S]3)N(C=C2)C(C)(C)C)C=CN1C(C)(C)C |
Title of publication | Synthesis and Structures of Cadmium Carboxylate and Thiocarboxylate Compounds with a Sulfur-Rich Coordination Environment: Carboxylate Exchange Kinetics Involving Tris(2-mercapto-1-t-butylimidazolyl)hydroborato Cadmium Complexes, [Tm(Bu(t))]Cd(O2CR). |
Authors of publication | Kreider-Mueller, Ava; Quinlivan, Patrick J.; Owen, Jonathan S.; Parkin, Gerard |
Journal of publication | Inorganic chemistry |
Year of publication | 2015 |
Journal volume | 54 |
Journal issue | 8 |
Pages of publication | 3835 - 3850 |
a | 10.0324 ± 0.0007 Å |
b | 11.0195 ± 0.0008 Å |
c | 30.106 ± 0.002 Å |
α | 90° |
β | 90.485 ± 0.001° |
γ | 90° |
Cell volume | 3328.2 ± 0.4 Å3 |
Cell temperature | 150 ± 2 K |
Ambient diffraction temperature | 150 ± 2 K |
Number of distinct elements | 8 |
Space group number | 14 |
Hermann-Mauguin space group symbol | P 1 21/n 1 |
Hall space group symbol | -P 2yn |
Residual factor for all reflections | 0.1237 |
Residual factor for significantly intense reflections | 0.0526 |
Weighted residual factors for significantly intense reflections | 0.0872 |
Weighted residual factors for all reflections included in the refinement | 0.1082 |
Goodness-of-fit parameter for all reflections included in the refinement | 0.992 |
Diffraction radiation wavelength | 0.71073 Å |
Diffraction radiation type | MoKα |