Information card for entry 4342744
Common name | SrUP2S8 |
Formula | P2 S8 Sr U |
Calculated formula | P2 S8 Sr U |
Title of publication | Syntheses, Crystal Structures, Optical and Theoretical Studies of the Actinide Thiophosphates SrU(PS4)2, BaU(PS4)2, and SrTh(PS4)2. |
Authors of publication | Mesbah, Adel; Prakash, Jai; Beard, Jessica C.; Lebègue, Sébastien; Malliakas, Christos D.; Ibers, James A. |
Journal of publication | Inorganic chemistry |
Year of publication | 2015 |
Journal volume | 54 |
Journal issue | 6 |
Pages of publication | 2970 - 2975 |
a | 10.9717 ± 0.0002 Å |
b | 10.9717 ± 0.0002 Å |
c | 9.5734 ± 0.0002 Å |
α | 90° |
β | 90° |
γ | 90° |
Cell volume | 1152.43 ± 0.04 Å3 |
Cell temperature | 100 ± 2 K |
Ambient diffraction temperature | 100 ± 2 K |
Number of distinct elements | 4 |
Space group number | 135 |
Hermann-Mauguin space group symbol | P 42/m b c |
Hall space group symbol | -P 4c 2ab |
Residual factor for all reflections | 0.0178 |
Residual factor for significantly intense reflections | 0.0126 |
Weighted residual factors for significantly intense reflections | 0.0279 |
Weighted residual factors for all reflections included in the refinement | 0.0296 |
Goodness-of-fit parameter for all reflections included in the refinement | 1.281 |
Diffraction radiation wavelength | 0.71073 Å |
Diffraction radiation type | MoKα |