Information card for entry 4342749
Formula | Fe2 H85 Na13 O104 Si2 W16 |
Calculated formula | Fe2 Na13 O104 Si2 W16 |
Title of publication | Synthesis and Characterization of a Series of [M2(β-SiW8O31)2](n-) Clusters and Mechanistic Insight into the Reorganization of {β-SiW8O31} into {α-SiW9O34}. |
Authors of publication | Winter, Ross S.; Long, De-Liang; Cronin, Leroy |
Journal of publication | Inorganic chemistry |
Year of publication | 2015 |
Journal volume | 54 |
Journal issue | 8 |
Pages of publication | 4151 - 4155 |
a | 11.8707 ± 0.0005 Å |
b | 13.4005 ± 0.0006 Å |
c | 16.7965 ± 0.0007 Å |
α | 110.929 ± 0.002° |
β | 93.479 ± 0.002° |
γ | 108.658 ± 0.002° |
Cell volume | 2317.77 ± 0.18 Å3 |
Cell temperature | 150 ± 2 K |
Ambient diffraction temperature | 150 ± 2 K |
Number of distinct elements | 6 |
Space group number | 2 |
Hermann-Mauguin space group symbol | P -1 |
Hall space group symbol | -P 1 |
Residual factor for all reflections | 0.0322 |
Residual factor for significantly intense reflections | 0.027 |
Weighted residual factors for significantly intense reflections | 0.0668 |
Weighted residual factors for all reflections included in the refinement | 0.0704 |
Goodness-of-fit parameter for all reflections included in the refinement | 1.027 |
Diffraction radiation wavelength | 0.71073 Å |
Diffraction radiation type | MoKα |