Information card for entry 4342756
Common name | Co-btm-SCN |
Formula | C12 H14 Co N14 O S2 |
Calculated formula | C12 H14 Co N14 O S2 |
Title of publication | Cobalt(II) Coordination Polymer Exhibiting Single-Ion-Magnet-Type Field-Induced Slow Relaxation Behavior. |
Authors of publication | Zhu, Yuan-Yuan; Zhu, Ming-Sheng; Yin, Ting-Ting; Meng, Yin-Shan; Wu, Zong-Quan; Zhang, Yi-Quan; Gao, Song |
Journal of publication | Inorganic chemistry |
Year of publication | 2015 |
Journal volume | 54 |
Journal issue | 8 |
Pages of publication | 3716 - 3718 |
a | 12.604 ± 0.003 Å |
b | 9.4717 ± 0.0019 Å |
c | 17.497 ± 0.004 Å |
α | 90° |
β | 90° |
γ | 90° |
Cell volume | 2088.8 ± 0.8 Å3 |
Cell temperature | 153 ± 2 K |
Ambient diffraction temperature | 153 ± 2 K |
Number of distinct elements | 6 |
Space group number | 63 |
Hermann-Mauguin space group symbol | C m c m |
Hall space group symbol | -C 2c 2 |
Residual factor for all reflections | 0.076 |
Residual factor for significantly intense reflections | 0.0591 |
Weighted residual factors for significantly intense reflections | 0.1818 |
Weighted residual factors for all reflections included in the refinement | 0.2137 |
Goodness-of-fit parameter for all reflections included in the refinement | 1.18 |
Diffraction radiation wavelength | 0.71073 Å |
Diffraction radiation type | MoKα |