Information card for entry 4342758
Common name | Zn(Co)-btm-SCN |
Formula | C12 H14 N14 O S2 Zn |
Calculated formula | C12 H14 N14 O S2 Zn |
Title of publication | Cobalt(II) Coordination Polymer Exhibiting Single-Ion-Magnet-Type Field-Induced Slow Relaxation Behavior. |
Authors of publication | Zhu, Yuan-Yuan; Zhu, Ming-Sheng; Yin, Ting-Ting; Meng, Yin-Shan; Wu, Zong-Quan; Zhang, Yi-Quan; Gao, Song |
Journal of publication | Inorganic chemistry |
Year of publication | 2015 |
Journal volume | 54 |
Journal issue | 8 |
Pages of publication | 3716 - 3718 |
a | 12.5908 ± 0.0005 Å |
b | 9.5436 ± 0.0004 Å |
c | 17.6577 ± 0.0008 Å |
α | 90° |
β | 90° |
γ | 90° |
Cell volume | 2121.78 ± 0.16 Å3 |
Cell temperature | 180 ± 2 K |
Ambient diffraction temperature | 180 ± 2 K |
Number of distinct elements | 6 |
Space group number | 63 |
Hermann-Mauguin space group symbol | C m c m |
Hall space group symbol | -C 2c 2 |
Residual factor for all reflections | 0.0415 |
Residual factor for significantly intense reflections | 0.0374 |
Weighted residual factors for significantly intense reflections | 0.1509 |
Weighted residual factors for all reflections included in the refinement | 0.1589 |
Goodness-of-fit parameter for all reflections included in the refinement | 1.043 |
Diffraction radiation wavelength | 0.71073 Å |
Diffraction radiation type | MoKα |