Information card for entry 4342760
Formula | C135 H180 Fe4 N12 Ni2 O26 |
Calculated formula | C135 H180 Fe4 N12 Ni2 O26 |
Title of publication | Heterometallic Coordination Polymers Assembled from Trigonal Trinuclear Fe2Ni-Pivalate Blocks and Polypyridine Spacers: Topological Diversity, Sorption, and Catalytic Properties. |
Authors of publication | Sotnik, Svetlana A.; Polunin, Ruslan A.; Kiskin, Mikhail A.; Kirillov, Alexander M.; Dorofeeva, Victoria N.; Gavrilenko, Konstantin S.; Eremenko, Igor L.; Novotortsev, Vladimir M.; Kolotilov, Sergey V. |
Journal of publication | Inorganic chemistry |
Year of publication | 2015 |
Journal volume | 54 |
Journal issue | 11 |
Pages of publication | 5169 - 5181 |
a | 12.514 ± 0.002 Å |
b | 60.998 ± 0.009 Å |
c | 12.873 ± 0.002 Å |
α | 90° |
β | 98.645 ± 0.003° |
γ | 90° |
Cell volume | 9715 ± 3 Å3 |
Cell temperature | 296 ± 2 K |
Ambient diffraction temperature | 296 ± 2 K |
Number of distinct elements | 6 |
Space group number | 4 |
Hermann-Mauguin space group symbol | P 1 21 1 |
Hall space group symbol | P 2yb |
Residual factor for all reflections | 0.2036 |
Residual factor for significantly intense reflections | 0.1013 |
Weighted residual factors for significantly intense reflections | 0.227 |
Weighted residual factors for all reflections included in the refinement | 0.2683 |
Goodness-of-fit parameter for all reflections included in the refinement | 0.841 |
Diffraction radiation wavelength | 0.71073 Å |
Diffraction radiation type | MoKα |