Information card for entry 4342762
Formula | C50 H68 Fe2 N4 Ni O13 |
Calculated formula | C50 H68 Fe2 N4 Ni O13 |
Title of publication | Heterometallic Coordination Polymers Assembled from Trigonal Trinuclear Fe2Ni-Pivalate Blocks and Polypyridine Spacers: Topological Diversity, Sorption, and Catalytic Properties. |
Authors of publication | Sotnik, Svetlana A.; Polunin, Ruslan A.; Kiskin, Mikhail A.; Kirillov, Alexander M.; Dorofeeva, Victoria N.; Gavrilenko, Konstantin S.; Eremenko, Igor L.; Novotortsev, Vladimir M.; Kolotilov, Sergey V. |
Journal of publication | Inorganic chemistry |
Year of publication | 2015 |
Journal volume | 54 |
Journal issue | 11 |
Pages of publication | 5169 - 5181 |
a | 13.1615 ± 0.0011 Å |
b | 16.9299 ± 0.0014 Å |
c | 30.922 ± 0.003 Å |
α | 90° |
β | 92.319 ± 0.002° |
γ | 90° |
Cell volume | 6884.5 ± 1 Å3 |
Cell temperature | 160 ± 2 K |
Ambient diffraction temperature | 160 ± 2 K |
Number of distinct elements | 6 |
Space group number | 14 |
Hermann-Mauguin space group symbol | P 1 21/c 1 |
Hall space group symbol | -P 2ybc |
Residual factor for all reflections | 0.1303 |
Residual factor for significantly intense reflections | 0.0622 |
Weighted residual factors for significantly intense reflections | 0.1419 |
Weighted residual factors for all reflections included in the refinement | 0.1611 |
Goodness-of-fit parameter for all reflections included in the refinement | 0.834 |
Diffraction radiation wavelength | 0.71073 Å |
Diffraction radiation type | MoKα |