Information card for entry 4342765
Formula | C4 H14 Ca0.5 N O7 P2 |
Calculated formula | C4 H14 Ca0.5 N O7 P2 |
Title of publication | Multidimensional (0D to 3D) Alkaline-Earth Metal Diphosphonates: Synthesis, Structural Diversity, and Luminescence Properties. |
Authors of publication | Senthil Raja, Duraisamy; Lin, Pin-Chun; Liu, Wei-Ren; Zhan, Jun-Xiang; Fu, Xin-Yi; Lin, Chia-Her |
Journal of publication | Inorganic chemistry |
Year of publication | 2015 |
Journal volume | 54 |
Journal issue | 9 |
Pages of publication | 4268 - 4278 |
a | 5.7106 ± 0.0002 Å |
b | 15.3214 ± 0.0007 Å |
c | 12.3862 ± 0.0006 Å |
α | 90° |
β | 102.893 ± 0.002° |
γ | 90° |
Cell volume | 1056.4 ± 0.08 Å3 |
Cell temperature | 295 ± 2 K |
Ambient diffraction temperature | 295 ± 2 K |
Number of distinct elements | 6 |
Space group number | 14 |
Hermann-Mauguin space group symbol | P 1 21/n 1 |
Hall space group symbol | -P 2yn |
Residual factor for all reflections | 0.0412 |
Residual factor for significantly intense reflections | 0.0322 |
Weighted residual factors for significantly intense reflections | 0.0832 |
Weighted residual factors for all reflections included in the refinement | 0.0876 |
Goodness-of-fit parameter for all reflections included in the refinement | 0.986 |
Diffraction radiation wavelength | 0.71073 Å |
Diffraction radiation type | MoKα |