Information card for entry 4342777
Formula | C65 H78 Cl Co N3 |
Calculated formula | C65 H78 Cl Co N3 |
SMILES | [Co](Cl)(Nc1c(cccc1c1c(cc(cc1C)C)C)c1c(cc(cc1C)C)C)=C1N(C=CN1c1c(cccc1C(C)C)C(C)C)c1c(cccc1C(C)C)C(C)C.c1(ccccc1)C.c1(ccccc1)C |
Title of publication | Protonolysis and amide exchange reactions of a three-coordinate cobalt amide complex supported by an N-heterocyclic carbene ligand. |
Authors of publication | Hansen, Christopher B.; Jordan, Richard F.; Hillhouse, Gregory L. |
Journal of publication | Inorganic chemistry |
Year of publication | 2015 |
Journal volume | 54 |
Journal issue | 10 |
Pages of publication | 4603 - 4610 |
a | 10.007 ± 0.0007 Å |
b | 28.2641 ± 0.0019 Å |
c | 39.221 ± 0.003 Å |
α | 90° |
β | 90° |
γ | 90° |
Cell volume | 11093.2 ± 1.4 Å3 |
Cell temperature | 100 ± 2 K |
Ambient diffraction temperature | 100 ± 2 K |
Number of distinct elements | 5 |
Space group number | 61 |
Hermann-Mauguin space group symbol | P b c a |
Hall space group symbol | -P 2ac 2ab |
Residual factor for all reflections | 0.0735 |
Residual factor for significantly intense reflections | 0.0499 |
Weighted residual factors for significantly intense reflections | 0.0988 |
Weighted residual factors for all reflections included in the refinement | 0.1069 |
Goodness-of-fit parameter for all reflections included in the refinement | 1.172 |
Diffraction radiation wavelength | 0.71073 Å |
Diffraction radiation type | MoKα |