Information card for entry 4342787
Formula | C96 H72 F18 N30 O18 S6 Zn3 |
Calculated formula | C96 H72 F18 N30 O18 S6 Zn3 |
Title of publication | Formation and Transmetalation Mechanisms of Homo- and Heterometallic (Fe/Zn) Trinuclear Triple-Stranded Side-by-Side Helicates. |
Authors of publication | Akhuli, Bidyut; Cera, Luca; Jana, Barun; Saha, Subrata; Schalley, Christoph A.; Ghosh, Pradyut |
Journal of publication | Inorganic chemistry |
Year of publication | 2015 |
Journal volume | 54 |
Journal issue | 9 |
Pages of publication | 4231 - 4242 |
a | 12.9568 ± 0.0011 Å |
b | 22.3513 ± 0.0018 Å |
c | 25.396 ± 0.002 Å |
α | 72.76 ± 0.002° |
β | 89.61 ± 0.002° |
γ | 73.586 ± 0.002° |
Cell volume | 6714.2 ± 1 Å3 |
Cell temperature | 150 ± 2 K |
Ambient diffraction temperature | 150 ± 2 K |
Number of distinct elements | 7 |
Space group number | 2 |
Hermann-Mauguin space group symbol | P -1 |
Hall space group symbol | -P 1 |
Residual factor for all reflections | 0.0585 |
Residual factor for significantly intense reflections | 0.0449 |
Weighted residual factors for significantly intense reflections | 0.1445 |
Weighted residual factors for all reflections included in the refinement | 0.1521 |
Goodness-of-fit parameter for all reflections included in the refinement | 1.063 |
Diffraction radiation wavelength | 0.71073 Å |
Diffraction radiation type | MoKα |