Information card for entry 4342797
Formula | C52 H40 Cu F6 N2 O P3 |
Calculated formula | C52 H40 Cu F6 N2 O P3 |
Title of publication | Three reversible polymorphic copper(i) complexes triggered by ligand conformation: insights into polymorphic crystal habit and luminescent properties. |
Authors of publication | Chai, Wenxiang; Hong, Mingwei; Song, Li; Jia, Guohua; Shi, Hongsheng; Guo, Jiayu; Shu, Kangying; Guo, Bing; Zhang, Yicheng; You, Wenwu; Chen, Xueyuan |
Journal of publication | Inorganic chemistry |
Year of publication | 2015 |
Journal volume | 54 |
Journal issue | 9 |
Pages of publication | 4200 - 4207 |
a | 11.0462 ± 0.0004 Å |
b | 30.5471 ± 0.0012 Å |
c | 13.9069 ± 0.0006 Å |
α | 90° |
β | 99.544 ± 0.004° |
γ | 90° |
Cell volume | 4627.6 ± 0.3 Å3 |
Cell temperature | 293 ± 2 K |
Ambient diffraction temperature | 293 ± 2 K |
Number of distinct elements | 7 |
Space group number | 14 |
Hermann-Mauguin space group symbol | P 1 21/c 1 |
Hall space group symbol | -P 2ybc |
Residual factor for all reflections | 0.09 |
Residual factor for significantly intense reflections | 0.0635 |
Weighted residual factors for significantly intense reflections | 0.1097 |
Weighted residual factors for all reflections included in the refinement | 0.1181 |
Goodness-of-fit parameter for all reflections included in the refinement | 1.239 |
Diffraction radiation wavelength | 0.7107 Å |
Diffraction radiation type | MoKα |