Information card for entry 4342800
Formula | C22 H42 Br2 Fe N2 P2 |
Calculated formula | C22 H42 Br2 Fe N2 P2 |
SMILES | Br[Fe]12(Br)[P](Cc3[n]2c(cnc3)C[P]1(C(C)(C)C)C(C)(C)C)(C(C)(C)C)C(C)(C)C |
Title of publication | Synthesis and reactivity of iron complexes with a new pyrazine-based pincer ligand, and application in catalytic low-pressure hydrogenation of carbon dioxide. |
Authors of publication | Rivada-Wheelaghan, Orestes; Dauth, Alexander; Leitus, Gregory; Diskin-Posner, Yael; Milstein, David |
Journal of publication | Inorganic chemistry |
Year of publication | 2015 |
Journal volume | 54 |
Journal issue | 9 |
Pages of publication | 4526 - 4538 |
a | 11.9 ± 0.006 Å |
b | 16.628 ± 0.009 Å |
c | 14.973 ± 0.006 Å |
α | 90° |
β | 114.13 ± 0.03° |
γ | 90° |
Cell volume | 2704 ± 2 Å3 |
Cell temperature | 100 ± 2 K |
Ambient diffraction temperature | 100 ± 2 K |
Number of distinct elements | 6 |
Space group number | 14 |
Hermann-Mauguin space group symbol | P 1 21/c 1 |
Hall space group symbol | -P 2ybc |
Residual factor for all reflections | 0.0264 |
Residual factor for significantly intense reflections | 0.0203 |
Weighted residual factors for significantly intense reflections | 0.0477 |
Weighted residual factors for all reflections included in the refinement | 0.0499 |
Goodness-of-fit parameter for all reflections included in the refinement | 1.014 |
Diffraction radiation wavelength | 0.71073 Å |
Diffraction radiation type | MoKα |