Information card for entry 4342829
Common name | XW-VONi |
Formula | C53 H49 F6 N9 Ni O8 S2 V |
Calculated formula | C53 H49 F6 N9 Ni O8 S2 V |
SMILES | [Ni]1234([O]=[V]567N8c9ccccc9N5C(=CC(=[N]6c5ccccc5[N]7=C(C=C8C)C)C)C)[n]5c(cccc5C(c5[n]3cccc5)(c3[n]4cccc3)C)C(c3[n]1cccc3)(c1[n]2cccc1)C.S(=O)(=O)([O-])C(F)(F)F.S(=O)(=O)([O-])C(F)(F)F.O |
Title of publication | Synthesis of Unsupported d(1)-d(x) Oxido-Bridged Heterobimetallic Complexes Containing V(IV): A New Direction for Metal-to-Metal Charge Transfer. |
Authors of publication | Wu, Xinyuan; Huang, Tao; Lekich, Travis T.; Sommer, Roger D.; Weare, Walter W. |
Journal of publication | Inorganic chemistry |
Year of publication | 2015 |
Journal volume | 54 |
Journal issue | 11 |
Pages of publication | 5322 - 5328 |
a | 18.3482 ± 0.0006 Å |
b | 15.7837 ± 0.0004 Å |
c | 19.1046 ± 0.0006 Å |
α | 90° |
β | 113.556 ± 0.002° |
γ | 90° |
Cell volume | 5071.7 ± 0.3 Å3 |
Cell temperature | 110 ± 2 K |
Ambient diffraction temperature | 110 ± 2 K |
Number of distinct elements | 8 |
Space group number | 14 |
Hermann-Mauguin space group symbol | P 1 21/n 1 |
Hall space group symbol | -P 2yn |
Residual factor for all reflections | 0.0541 |
Residual factor for significantly intense reflections | 0.0336 |
Weighted residual factors for significantly intense reflections | 0.0744 |
Weighted residual factors for all reflections included in the refinement | 0.0825 |
Goodness-of-fit parameter for all reflections included in the refinement | 1.013 |
Diffraction radiation wavelength | 0.71073 Å |
Diffraction radiation type | MoKα |