Information card for entry 4342831
Formula | C34 H52 Cu4 N4 O23 |
Calculated formula | C34 H52 Cu4 N4 O23 |
Title of publication | New Tetracopper(II) Cubane Cores Driven by a Diamino Alcohol: Self-assembly Synthesis, Structural and Topological Features, and Magnetic and Catalytic Oxidation Properties. |
Authors of publication | Dias, Sara S. P.; Kirillova, Marina V.; André, Vânia; Kłak, Julia; Kirillov, Alexander M. |
Journal of publication | Inorganic chemistry |
Year of publication | 2015 |
Journal volume | 54 |
Journal issue | 11 |
Pages of publication | 5204 - 5212 |
a | 17.7705 ± 0.0009 Å |
b | 22.3871 ± 0.0012 Å |
c | 23.521 ± 0.0013 Å |
α | 90° |
β | 90° |
γ | 90° |
Cell volume | 9357.4 ± 0.9 Å3 |
Cell temperature | 150 ± 2 K |
Ambient diffraction temperature | 150 ± 2 K |
Number of distinct elements | 5 |
Space group number | 61 |
Hermann-Mauguin space group symbol | P b c a |
Hall space group symbol | -P 2ac 2ab |
Residual factor for all reflections | 0.1624 |
Residual factor for significantly intense reflections | 0.0943 |
Weighted residual factors for significantly intense reflections | 0.1671 |
Weighted residual factors for all reflections included in the refinement | 0.189 |
Goodness-of-fit parameter for all reflections included in the refinement | 1.105 |
Diffraction radiation wavelength | 0.71073 Å |
Diffraction radiation type | MoKα |