Information card for entry 4342838
Formula | C36 H24 B2 Co F8 N12 |
Calculated formula | C36 H24 B2 Co F8 N12 |
SMILES | [Co]1234([n]5ccncc5c5[n]1c(cc(c5)c1ccncc1)c1[n]2ccnc1)[n]1ccncc1c1[n]3c(cc(c1)c1ccncc1)c1[n]4ccnc1.[B](F)(F)(F)[F-].[B](F)(F)(F)[F-] |
Title of publication | Spin Crossover, Reversible Redox, and Supramolecular Interactions in 3d Complexes of 4-(4-Pyridyl)-2,5-dipyrazyl-pyridine. |
Authors of publication | Miller, Reece G.; Brooker, Sally |
Journal of publication | Inorganic chemistry |
Year of publication | 2015 |
Journal volume | 54 |
Journal issue | 11 |
Pages of publication | 5398 - 5409 |
a | 16.9153 ± 0.0005 Å |
b | 8.9203 ± 0.0002 Å |
c | 23.4566 ± 0.0006 Å |
α | 90° |
β | 101.141 ± 0.003° |
γ | 90° |
Cell volume | 3472.66 ± 0.16 Å3 |
Cell temperature | 100 ± 2 K |
Ambient diffraction temperature | 100 ± 2 K |
Number of distinct elements | 6 |
Space group number | 14 |
Hermann-Mauguin space group symbol | P 1 21/n 1 |
Hall space group symbol | -P 2yn |
Residual factor for all reflections | 0.0877 |
Residual factor for significantly intense reflections | 0.0704 |
Weighted residual factors for significantly intense reflections | 0.1826 |
Weighted residual factors for all reflections included in the refinement | 0.1975 |
Goodness-of-fit parameter for all reflections included in the refinement | 1.045 |
Diffraction radiation wavelength | 1.54184 Å |
Diffraction radiation type | CuKα |