Information card for entry 4342854
Formula | C76 H56 F24 N14 P4 Ru2 S2 |
Calculated formula | C76 H56 F24 N14 P4 Ru2 S2 |
Title of publication | Synthesis, Electrochemistry, and Single-Molecule Conductance of Bimetallic 2,3,5,6-Tetra(pyridine-2-yl)pyrazine-Based Complexes. |
Authors of publication | Davidson, Ross; Liang, Jing-Hong; Costa Milan, David; Mao, Bing-Wei; Nichols, Richard J.; Higgins, Simon J.; Yufit, Dmitry S.; Beeby, Andrew; Low, Paul J. |
Journal of publication | Inorganic chemistry |
Year of publication | 2015 |
Journal volume | 54 |
Journal issue | 11 |
Pages of publication | 5487 - 5494 |
a | 12.926 ± 0.002 Å |
b | 13.311 ± 0.002 Å |
c | 29.507 ± 0.004 Å |
α | 99.1 ± 0.002° |
β | 90.219 ± 0.002° |
γ | 115.547 ± 0.002° |
Cell volume | 4508.1 ± 1.2 Å3 |
Cell temperature | 120 K |
Ambient diffraction temperature | 120 K |
Number of distinct elements | 7 |
Space group number | 2 |
Hermann-Mauguin space group symbol | P -1 |
Hall space group symbol | -P 1 |
Residual factor for all reflections | 0.1399 |
Residual factor for significantly intense reflections | 0.0961 |
Weighted residual factors for significantly intense reflections | 0.2575 |
Weighted residual factors for all reflections included in the refinement | 0.2777 |
Goodness-of-fit parameter for all reflections included in the refinement | 1.089 |
Diffraction radiation probe | x-ray |
Diffraction radiation wavelength | 0.71073 Å |
Diffraction radiation type | MoKα |