Information card for entry 4342861
Formula | C14 H10 B2 O11 Tb |
Calculated formula | C14 H10 B2 O11 Tb |
Title of publication | A family of lanthanide-based coordination polymers with boronic Acid as ligand. |
Authors of publication | Fan, Xiao; Freslon, Stéphane; Daiguebonne, Carole; Pollès, Laurent Le; Calvez, Guillaume; Bernot, Kevin; Yi, Xiaohui; Huang, Gang; Guillou, Olivier |
Journal of publication | Inorganic chemistry |
Year of publication | 2015 |
Journal volume | 54 |
Journal issue | 11 |
Pages of publication | 5534 - 5546 |
a | 8.5704 ± 0.0001 Å |
b | 19.5441 ± 0.0001 Å |
c | 21.4191 ± 0.0003 Å |
α | 90° |
β | 90° |
γ | 90° |
Cell volume | 3587.72 ± 0.07 Å3 |
Cell temperature | 293 ± 2 K |
Ambient diffraction temperature | 293 ± 2 K |
Number of distinct elements | 5 |
Space group number | 61 |
Hermann-Mauguin space group symbol | P b c a |
Hall space group symbol | -P 2ac 2ab |
Residual factor for all reflections | 0.0631 |
Residual factor for significantly intense reflections | 0.0385 |
Weighted residual factors for significantly intense reflections | 0.0938 |
Weighted residual factors for all reflections included in the refinement | 0.1062 |
Goodness-of-fit parameter for all reflections included in the refinement | 1.077 |
Diffraction radiation probe | x-ray |
Diffraction radiation wavelength | 0.71073 Å |
Diffraction radiation type | MoKα |