Information card for entry 4342874
Formula | C58 H50 Ce2 Mo2 N31 O12 |
Calculated formula | C58 H50 Ce2 Mo2 N31 O12 |
Title of publication | Visible to Near-Infrared Emission from Ln(III)(Bis-oxazoline)-[Mo(V)(CN)8] (Ln = Ce-Yb) Magnetic Coordination Polymers Showing Unusual Lanthanide-Dependent Sliding of Cyanido-Bridged Layers. |
Authors of publication | Chorazy, Szymon; Arczynski, Mirosław; Nakabayashi, Koji; Sieklucka, Barbara; Ohkoshi, Shin-Ichi |
Journal of publication | Inorganic chemistry |
Year of publication | 2015 |
Journal volume | 54 |
Journal issue | 10 |
Pages of publication | 4724 - 4736 |
a | 10.7075 ± 0.0006 Å |
b | 19.3757 ± 0.0009 Å |
c | 19.4865 ± 0.0011 Å |
α | 84.271 ± 0.002° |
β | 83.044 ± 0.002° |
γ | 76.644 ± 0.002° |
Cell volume | 3893.7 ± 0.4 Å3 |
Cell temperature | 90 ± 2 K |
Ambient diffraction temperature | 90 ± 2 K |
Number of distinct elements | 6 |
Space group number | 2 |
Hermann-Mauguin space group symbol | P -1 |
Hall space group symbol | -P 1 |
Residual factor for all reflections | 0.0669 |
Residual factor for significantly intense reflections | 0.0441 |
Weighted residual factors for significantly intense reflections | 0.1067 |
Weighted residual factors for all reflections included in the refinement | 0.1437 |
Goodness-of-fit parameter for all reflections included in the refinement | 1.113 |
Diffraction radiation wavelength | 0.71075 Å |
Diffraction radiation type | MoKα |