Information card for entry 4342884
Formula | C25 H8 Ho Mo N14 O5 |
Calculated formula | C25 H8 Ho Mo N14 O5 |
Title of publication | Visible to Near-Infrared Emission from Ln(III)(Bis-oxazoline)-[Mo(V)(CN)8] (Ln = Ce-Yb) Magnetic Coordination Polymers Showing Unusual Lanthanide-Dependent Sliding of Cyanido-Bridged Layers. |
Authors of publication | Chorazy, Szymon; Arczynski, Mirosław; Nakabayashi, Koji; Sieklucka, Barbara; Ohkoshi, Shin-Ichi |
Journal of publication | Inorganic chemistry |
Year of publication | 2015 |
Journal volume | 54 |
Journal issue | 10 |
Pages of publication | 4724 - 4736 |
a | 10.4302 ± 0.0006 Å |
b | 19.212 ± 0.001 Å |
c | 17.649 ± 0.0009 Å |
α | 90° |
β | 97.841 ± 0.002° |
γ | 90° |
Cell volume | 3503.5 ± 0.3 Å3 |
Cell temperature | 250 ± 2 K |
Ambient diffraction temperature | 250 ± 2 K |
Number of distinct elements | 6 |
Space group number | 14 |
Hermann-Mauguin space group symbol | P 1 21/n 1 |
Hall space group symbol | -P 2yn |
Residual factor for all reflections | 0.0975 |
Residual factor for significantly intense reflections | 0.0777 |
Weighted residual factors for significantly intense reflections | 0.1195 |
Weighted residual factors for all reflections included in the refinement | 0.127 |
Goodness-of-fit parameter for all reflections included in the refinement | 1.134 |
Diffraction radiation wavelength | 0.71075 Å |
Diffraction radiation type | MoKα |