Information card for entry 4342895
Common name | cis,cis,trans-FeI2(CO)2(CNArMes2)2 |
Formula | C52 H50 Fe I2 N2 O2 |
Calculated formula | C52 H50 Fe I1.9999 N2 O2 |
Title of publication | Synthesis and protonation of an encumbered iron tetraisocyanide dianion. |
Authors of publication | Mokhtarzadeh, Charles C.; Margulieux, Grant W.; Carpenter, Alex E.; Weidemann, Nils; Moore, Curtis E.; Rheingold, Arnold L.; Figueroa, Joshua S. |
Journal of publication | Inorganic chemistry |
Year of publication | 2015 |
Journal volume | 54 |
Journal issue | 11 |
Pages of publication | 5579 - 5587 |
a | 13.5946 ± 0.0005 Å |
b | 14.6648 ± 0.0005 Å |
c | 15.0797 ± 0.0005 Å |
α | 64.878 ± 0.002° |
β | 64.999 ± 0.002° |
γ | 64.824 ± 0.001° |
Cell volume | 2353.46 ± 0.15 Å3 |
Cell temperature | 100 K |
Ambient diffraction temperature | 100 K |
Number of distinct elements | 6 |
Space group number | 2 |
Hermann-Mauguin space group symbol | P -1 |
Hall space group symbol | -P 1 |
Residual factor for all reflections | 0.0525 |
Residual factor for significantly intense reflections | 0.0412 |
Weighted residual factors for significantly intense reflections | 0.0954 |
Weighted residual factors for all reflections included in the refinement | 0.1015 |
Goodness-of-fit parameter for all reflections included in the refinement | 1.037 |
Diffraction radiation probe | x-ray |
Diffraction radiation wavelength | 0.71073 Å |
Diffraction radiation type | MoKα |