Information card for entry 4342907
Formula | C61 H101 Ge2 N8 O10 Ru4 Si4 |
Calculated formula | C61 H101 Ge2 N8 O10 Ru4 Si4 |
Title of publication | Reactivity Studies on a Binuclear Ruthenium(0) Complex Equipped with a Bridging κ(2)N,Ge-Amidinatogermylene Ligand. |
Authors of publication | Cabeza, Javier A.; Fernández-Colinas, José M; García-Álvarez, Pablo; Pérez-Carreño, Enrique; Polo, Diego |
Journal of publication | Inorganic chemistry |
Year of publication | 2015 |
Journal volume | 54 |
Journal issue | 10 |
Pages of publication | 4850 - 4861 |
a | 15.7223 ± 0.0006 Å |
b | 34.6848 ± 0.0007 Å |
c | 15.6391 ± 0.0005 Å |
α | 90 ± 0.004° |
β | 112.594 ± 0.004° |
γ | 90° |
Cell volume | 7873.8 ± 0.5 Å3 |
Cell temperature | 100 ± 2 K |
Ambient diffraction temperature | 100 ± 2 K |
Number of distinct elements | 7 |
Space group number | 14 |
Hermann-Mauguin space group symbol | P 1 21/c 1 |
Hall space group symbol | -P 2ybc |
Residual factor for all reflections | 0.1244 |
Residual factor for significantly intense reflections | 0.0632 |
Weighted residual factors for significantly intense reflections | 0.0768 |
Weighted residual factors for all reflections included in the refinement | 0.0936 |
Goodness-of-fit parameter for all reflections included in the refinement | 1.027 |
Diffraction radiation wavelength | 0.71073 Å |
Diffraction radiation type | MoKα |