Information card for entry 4342912
Common name | Palladium Carbonyl Phosphine Carbido Cluster |
Formula | C74 H129 Cl9 O28 P14 Pd36 |
Calculated formula | C74 H129 Cl9 O28 P14 Pd36 |
Title of publication | Nanosized {Pd4(μ4-C)}Pd32(CO)28(PMe3)14 Containing Tetrahedrally Deformed Pd4 Cage with Encapsulated Carbide Atom: Formal Substitution of Geometrically Analogous Interior Au4 Entity in Isostructural Au4Pd32(CO)28(PMe3)14 by Electronically Equivalent Pd4(μ4-C) and Computational/Catalytic Implications. |
Authors of publication | Mednikov, Evgueni G.; Ivanov, Sergei A.; Dahl, Lawrence F. |
Journal of publication | Inorganic chemistry |
Year of publication | 2015 |
Journal volume | 54 |
Journal issue | 13 |
Pages of publication | 6157 - 6168 |
a | 16.0975 ± 0.0016 Å |
b | 17.7114 ± 0.0017 Å |
c | 25.768 ± 0.003 Å |
α | 87.771 ± 0.002° |
β | 81.185 ± 0.001° |
γ | 80.053 ± 0.001° |
Cell volume | 7150.2 ± 1.3 Å3 |
Cell temperature | 100 ± 2 K |
Ambient diffraction temperature | 100 ± 2 K |
Number of distinct elements | 6 |
Space group number | 2 |
Hermann-Mauguin space group symbol | P -1 |
Hall space group symbol | -P 1 |
Residual factor for all reflections | 0.1014 |
Residual factor for significantly intense reflections | 0.0738 |
Weighted residual factors for significantly intense reflections | 0.1956 |
Weighted residual factors for all reflections included in the refinement | 0.2073 |
Goodness-of-fit parameter for all reflections included in the refinement | 1.329 |
Diffraction radiation wavelength | 0.71073 Å |
Diffraction radiation type | MoKα |