Information card for entry 4342925
Formula | C29 H41 B F4 Fe N2 O2.5 P |
Calculated formula | C29 H41 B F4 Fe N2 O2.5 P |
Title of publication | How Innocent are Potentially Redox Non-Innocent Ligands? Electronic Structure and Metal Oxidation States in Iron-PNN Complexes as a Representative Case Study. |
Authors of publication | Butschke, Burkhard; Fillman, Kathlyn L.; Bendikov, Tatyana; Shimon, Linda J. W.; Diskin-Posner, Yael; Leitus, Gregory; Gorelsky, Serge I.; Neidig, Michael L.; Milstein, David |
Journal of publication | Inorganic chemistry |
Year of publication | 2015 |
Journal volume | 54 |
Journal issue | 10 |
Pages of publication | 4909 - 4926 |
a | 21.743 ± 0.004 Å |
b | 8.7736 ± 0.0012 Å |
c | 18.932 ± 0.003 Å |
α | 90° |
β | 114.366 ± 0.007° |
γ | 90° |
Cell volume | 3289.9 ± 0.9 Å3 |
Cell temperature | 100 ± 2 K |
Ambient diffraction temperature | 100 ± 2 K |
Number of distinct elements | 8 |
Space group number | 14 |
Hermann-Mauguin space group symbol | P 1 21/c 1 |
Hall space group symbol | -P 2ybc |
Residual factor for all reflections | 0.0976 |
Residual factor for significantly intense reflections | 0.0598 |
Weighted residual factors for significantly intense reflections | 0.1586 |
Weighted residual factors for all reflections included in the refinement | 0.1835 |
Goodness-of-fit parameter for all reflections included in the refinement | 1.015 |
Diffraction radiation wavelength | 0.71073 Å |
Diffraction radiation type | MoKα |