Information card for entry 4342943
Formula | C31 H42 Br2 N2 O10 P2 Zn2 |
Calculated formula | C31 H42 Br2 N2 O10 P2 Zn2 |
Title of publication | Is single-4-ring the most basic but elusive secondary building unit that transforms to larger structures in zinc phosphate chemistry? |
Authors of publication | Dar, Aijaz A.; Sharma, Sunil K.; Murugavel, Ramaswamy |
Journal of publication | Inorganic chemistry |
Year of publication | 2015 |
Journal volume | 54 |
Journal issue | 10 |
Pages of publication | 4882 - 4894 |
a | 10.009 ± 0.004 Å |
b | 23.2864 ± 0.001 Å |
c | 17.488 ± 0.008 Å |
α | 90° |
β | 97.9 ± 0.007° |
γ | 90° |
Cell volume | 4037 ± 2 Å3 |
Cell temperature | 293 ± 2 K |
Ambient diffraction temperature | 293 ± 2 K |
Number of distinct elements | 7 |
Space group number | 14 |
Hermann-Mauguin space group symbol | P 1 21/n 1 |
Hall space group symbol | -P 2yn |
Residual factor for all reflections | 0.1013 |
Residual factor for significantly intense reflections | 0.0907 |
Weighted residual factors for significantly intense reflections | 0.1662 |
Weighted residual factors for all reflections included in the refinement | 0.1723 |
Goodness-of-fit parameter for all reflections included in the refinement | 1.208 |
Diffraction radiation wavelength | 0.71075 Å |
Diffraction radiation type | MoKα |