Information card for entry 4342974
Formula | C13 H13 Cl9 Cu N7 O2 Re2 |
Calculated formula | C13 H13 Cl9 Cu N7 O2 Re2 |
Title of publication | A Chiral, Photoluminescent, and Spin-Canted {Cu(I)Re(IV)2}n Branched Chain. |
Authors of publication | Martínez-Lillo, José; Armentano, Donatella; Fortea-Pérez, Francisco R; Stiriba, Salah-Eddine; De Munno, Giovanni; Lloret, Francesc; Julve, Miguel; Faus, Juan |
Journal of publication | Inorganic chemistry |
Year of publication | 2015 |
Journal volume | 54 |
Journal issue | 10 |
Pages of publication | 4594 - 4596 |
a | 8.5927 ± 0.0015 Å |
b | 10.561 ± 0.002 Å |
c | 30.457 ± 0.006 Å |
α | 90° |
β | 90° |
γ | 90° |
Cell volume | 2763.9 ± 0.9 Å3 |
Cell temperature | 291 ± 2 K |
Ambient diffraction temperature | 291 ± 2 K |
Number of distinct elements | 7 |
Space group number | 19 |
Hermann-Mauguin space group symbol | P 21 21 21 |
Hall space group symbol | P 2ac 2ab |
Residual factor for all reflections | 0.1086 |
Residual factor for significantly intense reflections | 0.0984 |
Weighted residual factors for significantly intense reflections | 0.2343 |
Weighted residual factors for all reflections included in the refinement | 0.2408 |
Goodness-of-fit parameter for all reflections included in the refinement | 1.074 |
Diffraction radiation wavelength | 0.71073 Å |
Diffraction radiation type | MoKα |