Information card for entry 4342981
Formula | C46 H62 F12 Fe N4 O4 |
Calculated formula | C46 H62 F12 Fe N4 O4 |
Title of publication | Four-Coordinate Iron(II) Diaryl Compounds with Monodentate N-Heterocyclic Carbene Ligation: Synthesis, Characterization, and Their Tetrahedral-Square Planar Isomerization in Solution. |
Authors of publication | Liu, Yuesheng; Luo, Lun; Xiao, Jie; Wang, Lei; Song, You; Qu, Jingping; Luo, Yi; Deng, Liang |
Journal of publication | Inorganic chemistry |
Year of publication | 2015 |
Journal volume | 54 |
Journal issue | 10 |
Pages of publication | 4752 - 4760 |
a | 18.323 ± 0.003 Å |
b | 16.883 ± 0.003 Å |
c | 15.291 ± 0.002 Å |
α | 90° |
β | 90° |
γ | 90° |
Cell volume | 4730.2 ± 1.3 Å3 |
Cell temperature | 140 ± 2 K |
Ambient diffraction temperature | 140 ± 2 K |
Number of distinct elements | 6 |
Space group number | 64 |
Hermann-Mauguin space group symbol | C m c a |
Hall space group symbol | -C 2ac 2 |
Residual factor for all reflections | 0.076 |
Residual factor for significantly intense reflections | 0.0599 |
Weighted residual factors for significantly intense reflections | 0.1728 |
Weighted residual factors for all reflections included in the refinement | 0.1959 |
Goodness-of-fit parameter for all reflections included in the refinement | 1.02 |
Diffraction radiation wavelength | 0.71073 Å |
Diffraction radiation type | MoKα |