Information card for entry 4342984
Chemical name | selenium dicyanide difluoride 18-crown-6-solvate |
Formula | C14 H24 F2 N2 O6 Se |
Calculated formula | C14 H24 F2 N2 O6 Se |
SMILES | [Se]123(C#N)(C#N)(F)(F)[O]4CC[O]1CC[O]2CC[O]3CCOCCOCC4 |
Title of publication | Structure and Chemistry of SeFx(CN)4-x Compounds. |
Authors of publication | Fritz, Stefanie; Ehm, Christian; Lentz, Dieter |
Journal of publication | Inorganic chemistry |
Year of publication | 2015 |
Journal volume | 54 |
Journal issue | 11 |
Pages of publication | 5220 - 5231 |
a | 8.4405 ± 0.0011 Å |
b | 17.999 ± 0.002 Å |
c | 12.5274 ± 0.0017 Å |
α | 90° |
β | 94.513 ± 0.003° |
γ | 90° |
Cell volume | 1897.3 ± 0.4 Å3 |
Cell temperature | 123 ± 2 K |
Ambient diffraction temperature | 123 ± 2 K |
Number of distinct elements | 6 |
Space group number | 14 |
Hermann-Mauguin space group symbol | P 1 21/n 1 |
Hall space group symbol | -P 2yn |
Residual factor for all reflections | 0.0302 |
Residual factor for significantly intense reflections | 0.0225 |
Weighted residual factors for significantly intense reflections | 0.0527 |
Weighted residual factors for all reflections included in the refinement | 0.0562 |
Goodness-of-fit parameter for all reflections included in the refinement | 1.042 |
Diffraction radiation wavelength | 0.71073 Å |
Diffraction radiation type | MoKα |