Information card for entry 4343004
Formula | C38 H64 Al2 N2 O2 |
Calculated formula | C38 H64 Al2 N2 O2 |
Title of publication | Syntheses of Mononuclear and Dinuclear Aluminum Complexes Stabilized by Phenolato Ligands and Their Applications in the Polymerization of ε-Caprolactone: A Comparative Study. |
Authors of publication | Chen, Lijuan; Li, Wenyi; Yuan, Dan; Zhang, Yong; Shen, Qi; Yao, Yingming |
Journal of publication | Inorganic chemistry |
Year of publication | 2015 |
Journal volume | 54 |
Journal issue | 10 |
Pages of publication | 4699 - 4708 |
a | 8.7345 ± 0.001 Å |
b | 10.4642 ± 0.0011 Å |
c | 12.0312 ± 0.001 Å |
α | 71.876 ± 0.007° |
β | 72.906 ± 0.007° |
γ | 87.727 ± 0.009° |
Cell volume | 997.3 ± 0.19 Å3 |
Cell temperature | 223 ± 2 K |
Ambient diffraction temperature | 223 ± 2 K |
Number of distinct elements | 5 |
Space group number | 2 |
Hermann-Mauguin space group symbol | P -1 |
Hall space group symbol | -P 1 |
Residual factor for all reflections | 0.0845 |
Residual factor for significantly intense reflections | 0.0519 |
Weighted residual factors for significantly intense reflections | 0.1303 |
Weighted residual factors for all reflections included in the refinement | 0.1438 |
Goodness-of-fit parameter for all reflections included in the refinement | 1.073 |
Diffraction radiation wavelength | 0.71075 Å |
Diffraction radiation type | MoKα |