Information card for entry 4343007
Formula | C42 H69 Al N2 O2 |
Calculated formula | C42 H69 Al N2 O2 |
Title of publication | Syntheses of Mononuclear and Dinuclear Aluminum Complexes Stabilized by Phenolato Ligands and Their Applications in the Polymerization of ε-Caprolactone: A Comparative Study. |
Authors of publication | Chen, Lijuan; Li, Wenyi; Yuan, Dan; Zhang, Yong; Shen, Qi; Yao, Yingming |
Journal of publication | Inorganic chemistry |
Year of publication | 2015 |
Journal volume | 54 |
Journal issue | 10 |
Pages of publication | 4699 - 4708 |
a | 13.057 ± 0.004 Å |
b | 13.344 ± 0.004 Å |
c | 13.504 ± 0.004 Å |
α | 113.134 ± 0.009° |
β | 93.388 ± 0.003° |
γ | 102.868 ± 0.007° |
Cell volume | 2080.9 ± 1.1 Å3 |
Cell temperature | 223 ± 2 K |
Ambient diffraction temperature | 223 ± 2 K |
Number of distinct elements | 5 |
Space group number | 2 |
Hermann-Mauguin space group symbol | P -1 |
Hall space group symbol | -P 1 |
Residual factor for all reflections | 0.1875 |
Residual factor for significantly intense reflections | 0.1076 |
Weighted residual factors for significantly intense reflections | 0.1925 |
Weighted residual factors for all reflections included in the refinement | 0.2327 |
Goodness-of-fit parameter for all reflections included in the refinement | 1.137 |
Diffraction radiation wavelength | 0.71075 Å |
Diffraction radiation type | MoKα |