Information card for entry 4343015
Formula | C52 H87 Cl N6 Ni6 O33 |
Calculated formula | C52 H69 Cl N6 Ni6 O33 |
Title of publication | A new family of ni4 and ni6 aggregates from the self-assembly of [ni2] building units: role of carboxylate and carbonate bridges. |
Authors of publication | Pait, Moumita; Bauzá, Antonio; Frontera, Antonio; Colacio, Enrique; Ray, Debashis |
Journal of publication | Inorganic chemistry |
Year of publication | 2015 |
Journal volume | 54 |
Journal issue | 10 |
Pages of publication | 4709 - 4723 |
a | 16.9227 ± 0.0006 Å |
b | 24.5016 ± 0.0008 Å |
c | 23.029 ± 0.0007 Å |
α | 90° |
β | 127.462 ± 0.002° |
γ | 90° |
Cell volume | 7579.3 ± 0.5 Å3 |
Cell temperature | 298 ± 2 K |
Ambient diffraction temperature | 298 ± 2 K |
Number of distinct elements | 6 |
Space group number | 14 |
Hermann-Mauguin space group symbol | P 1 21/c 1 |
Hall space group symbol | -P 2ybc |
Residual factor for all reflections | 0.1168 |
Residual factor for significantly intense reflections | 0.0557 |
Weighted residual factors for significantly intense reflections | 0.14 |
Weighted residual factors for all reflections included in the refinement | 0.1667 |
Goodness-of-fit parameter for all reflections included in the refinement | 1.024 |
Diffraction radiation wavelength | 0.71073 Å |
Diffraction radiation type | MoKα |