Information card for entry 4343024
Formula | C20 H24 Cu2 I2 N6 O |
Calculated formula | C20 H23 Cu2 I2 N6 O |
Title of publication | Vapochromic Luminescence and Flexibility Control of Porous Coordination Polymers by Substitution of Luminescent Multinuclear Cu(I) Cluster Nodes. |
Authors of publication | Hayashi, Takahiro; Kobayashi, Atsushi; Ohara, Hiroki; Yoshida, Masaki; Matsumoto, Takeshi; Chang, Ho-Chol; Kato, Masako |
Journal of publication | Inorganic chemistry |
Year of publication | 2015 |
Journal volume | 54 |
Journal issue | 18 |
Pages of publication | 8905 - 8913 |
a | 10.058 ± 0.003 Å |
b | 10.788 ± 0.003 Å |
c | 11.968 ± 0.003 Å |
α | 75.852 ± 0.012° |
β | 73.342 ± 0.011° |
γ | 88.951 ± 0.012° |
Cell volume | 1204.5 ± 0.6 Å3 |
Cell temperature | 273 K |
Ambient diffraction temperature | 273 K |
Number of distinct elements | 6 |
Space group number | 2 |
Hermann-Mauguin space group symbol | P -1 |
Hall space group symbol | -P 1 |
Residual factor for all reflections | 0.0729 |
Residual factor for significantly intense reflections | 0.051 |
Weighted residual factors for significantly intense reflections | 0.1157 |
Weighted residual factors for all reflections included in the refinement | 0.1225 |
Goodness-of-fit parameter for all reflections included in the refinement | 1.04 |
Diffraction radiation wavelength | 0.71075 Å |
Diffraction radiation type | MoKα |