Information card for entry 4343063
Formula | C60 H69 Dy N4 Si |
Calculated formula | C60 H69 Dy N4 Si |
Title of publication | Synthesis and Characterization of Organo-Rare-Earth Metal Monoalkyl Complexes Supported by Carbon σ-Bonded Indolyl Ligands: High Specific Isoprene 1,4-Cis Polymerization Catalysts. |
Authors of publication | Guo, Liping; Zhu, Xiancui; Zhang, Guangchao; Wei, Yun; Ning, Lixin; Zhou, Shuangliu; Feng, Zhijun; Wang, Shaowu; Mu, Xiaolong; Chen, Jun; Jiang, Yuzhe |
Journal of publication | Inorganic chemistry |
Year of publication | 2015 |
Journal volume | 54 |
Journal issue | 12 |
Pages of publication | 5725 - 5731 |
a | 25.79 ± 0.002 Å |
b | 20.009 ± 0.002 Å |
c | 10.779 ± 0.0012 Å |
α | 90° |
β | 102.402 ± 0.002° |
γ | 90° |
Cell volume | 5432.5 ± 0.9 Å3 |
Cell temperature | 293 ± 2 K |
Ambient diffraction temperature | 293 ± 2 K |
Number of distinct elements | 5 |
Space group number | 15 |
Hermann-Mauguin space group symbol | C 1 2/c 1 |
Hall space group symbol | -C 2yc |
Residual factor for all reflections | 0.0371 |
Residual factor for significantly intense reflections | 0.0279 |
Weighted residual factors for significantly intense reflections | 0.064 |
Weighted residual factors for all reflections included in the refinement | 0.0683 |
Goodness-of-fit parameter for all reflections included in the refinement | 1.013 |
Diffraction radiation wavelength | 0.71073 Å |
Diffraction radiation type | MoKα |