Information card for entry 4343073
Formula | C63 H80 B Cl Co N P3 |
Calculated formula | C63 H80 B Cl Co N P3 |
SMILES | [Co]12([P](c3c(N(c4c([P]2(C(C)C)C(C)C)cc(cc4)C)c2c([P]1(C(C)C)C(C)C)cc(cc2)C)ccc(c3)C)(C(C)C)C(C)C)Cl.c1(ccccc1)[B-](c1ccccc1)(c1ccccc1)c1ccccc1 |
Title of publication | Evaluating Molecular Cobalt Complexes for the Conversion of N2 to NH3. |
Authors of publication | Del Castillo, Trevor J.; Thompson, Niklas B.; Suess, Daniel L. M.; Ung, Gaël; Peters, Jonas C. |
Journal of publication | Inorganic chemistry |
Year of publication | 2015 |
Journal volume | 54 |
Journal issue | 19 |
Pages of publication | 9256 - 9262 |
a | 10.9491 ± 0.0007 Å |
b | 14.9096 ± 0.001 Å |
c | 17.8512 ± 0.0011 Å |
α | 83.935 ± 0.003° |
β | 79.063 ± 0.003° |
γ | 89.303 ± 0.003° |
Cell volume | 2845.1 ± 0.3 Å3 |
Cell temperature | 100 ± 2 K |
Ambient diffraction temperature | 100 K |
Number of distinct elements | 7 |
Space group number | 2 |
Hermann-Mauguin space group symbol | P -1 |
Hall space group symbol | -P 1 |
Residual factor for all reflections | 0.0986 |
Residual factor for significantly intense reflections | 0.0457 |
Weighted residual factors for significantly intense reflections | 0.0837 |
Weighted residual factors for all reflections included in the refinement | 0.0978 |
Goodness-of-fit parameter for all reflections included in the refinement | 1 |
Diffraction radiation wavelength | 0.71073 Å |
Diffraction radiation type | MoKα |