Information card for entry 4343083
Formula | C36 H28 B3 F18 N2 O4 Sb |
Calculated formula | C36 H28 B3 F18 N2 O4 Sb |
Title of publication | From Stiba- and Bismaheteroboroxines to N,C,N-Chelated Diorganoantimony(III) and Bismuth(III) Cations-An Unexpected Case of Aryl Group Migration. |
Authors of publication | Dostál, Libor; Jambor, Roman; Růžička, Aleš; Jirásko, Robert; Lyčka, Antonín; Beckmann, Jens; Ketkov, Sergey |
Journal of publication | Inorganic chemistry |
Year of publication | 2015 |
Journal volume | 54 |
Journal issue | 12 |
Pages of publication | 6010 - 6019 |
a | 10.884 ± 0.0008 Å |
b | 24.1291 ± 0.0005 Å |
c | 18.211 ± 0.0009 Å |
α | 90° |
β | 118.718 ± 0.007° |
γ | 90° |
Cell volume | 4194.3 ± 0.5 Å3 |
Cell temperature | 150 ± 1 K |
Ambient diffraction temperature | 150 ± 1 K |
Number of distinct elements | 7 |
Space group number | 14 |
Hermann-Mauguin space group symbol | P 1 21/c 1 |
Hall space group symbol | -P 2ybc |
Residual factor for all reflections | 0.0645 |
Residual factor for significantly intense reflections | 0.0463 |
Weighted residual factors for significantly intense reflections | 0.1049 |
Weighted residual factors for all reflections included in the refinement | 0.119 |
Goodness-of-fit parameter for all reflections included in the refinement | 1.066 |
Diffraction radiation wavelength | 0.71073 Å |
Diffraction radiation type | MoKα |