Information card for entry 4343088
Formula | Ca O4 Te |
Calculated formula | Ca O4 Te |
Title of publication | Hydrothermal Synthesis and Dehydration of CaTeO3(H2O): An Original Route to Generate New CaTeO3 Polymorphs. |
Authors of publication | Poupon, Morgane; Barrier, Nicolas; Petit, Sebastien; Clevers, Simon; Dupray, Valerie |
Journal of publication | Inorganic chemistry |
Year of publication | 2015 |
Journal volume | 54 |
Journal issue | 12 |
Pages of publication | 5660 - 5670 |
a | 14.78549 ± 0.00004 Å |
b | 6.79194 ± 0.00003 Å |
c | 8.06261 ± 0.00003 Å |
α | 90° |
β | 90° |
γ | 90° |
Cell volume | 809.665 ± 0.005 Å3 |
Cell temperature | 293 K |
Ambient diffraction temperature | 293 K |
Number of distinct elements | 3 |
Space group number | 33 |
Hermann-Mauguin space group symbol | P 21 c n |
Hall space group symbol | P -2n 2a |
Residual factor for all reflections | 0.0375 |
Residual factor for significantly intense reflections | 0.0366 |
Weighted residual factors for all reflections | 0.0432 |
Weighted residual factors for significantly intense reflections | 0.043 |
Goodness-of-fit parameter for all reflections | 1.7 |
Method of determination | powder diffraction |
Diffraction radiation probe | x-ray |
Diffraction radiation wavelength | 1.5406 Å |
Diffraction radiation type | CuKα1 |