Information card for entry 4343094
Formula | C71 H68 O Sn2 |
Calculated formula | C71 H68 O Sn2 |
SMILES | [Sn@]12([Sn@](c3cccc4C(c5cccc1c5Oc34)(C)C)(c1c(cccc1c1c(cc(cc1C)C)C)c1c(cc(cc1C)C)C)C=C2c1ccccc1)c1c(cccc1c1c(cc(cc1C)C)C)c1c(cc(cc1C)C)C.[Sn@@]12([Sn@@](c3cccc4C(c5cccc1c5Oc34)(C)C)(c1c(cccc1c1c(cc(cc1C)C)C)c1c(cc(cc1C)C)C)C=C2c1ccccc1)c1c(cccc1c1c(cc(cc1C)C)C)c1c(cc(cc1C)C)C |
Title of publication | Reversibility in Reactions of Linker-Bridged Distannenes with Terminal Alkynes at Ambient Temperature. |
Authors of publication | Schneider, Julia; Henning, Jens; Edrich, Jessica; Schubert, Hartmut; Wesemann, Lars |
Journal of publication | Inorganic chemistry |
Year of publication | 2015 |
Journal volume | 54 |
Journal issue | 12 |
Pages of publication | 6020 - 6027 |
a | 13.2912 ± 0.0002 Å |
b | 17.4961 ± 0.0003 Å |
c | 24.3671 ± 0.0004 Å |
α | 90° |
β | 96.633 ± 0.001° |
γ | 90° |
Cell volume | 5628.5 ± 0.16 Å3 |
Cell temperature | 100 ± 2 K |
Ambient diffraction temperature | 100 ± 2 K |
Number of distinct elements | 4 |
Space group number | 14 |
Hermann-Mauguin space group symbol | P 1 21/n 1 |
Hall space group symbol | -P 2yn |
Residual factor for all reflections | 0.05 |
Residual factor for significantly intense reflections | 0.029 |
Weighted residual factors for significantly intense reflections | 0.0534 |
Weighted residual factors for all reflections included in the refinement | 0.0587 |
Goodness-of-fit parameter for all reflections included in the refinement | 0.999 |
Diffraction radiation wavelength | 0.71073 Å |
Diffraction radiation type | MoKα |