Information card for entry 4343100
Formula | C34 H35 Cl4 Co N8 |
Calculated formula | C34 H35 Cl4 Co N8 |
Title of publication | A Series of [Co(Mabiq)Cl2-n] (n = 0, 1, 2) Compounds and Evidence for the Elusive Bimetallic Form. |
Authors of publication | Puttock, Emma V.; Banerjee, Priyabrata; Kaspar, Manuel; Drennen, Liam; Yufit, Dmitry S.; Bill, Eckhard; Sproules, Stephen; Hess, Corinna R. |
Journal of publication | Inorganic chemistry |
Year of publication | 2015 |
Journal volume | 54 |
Journal issue | 12 |
Pages of publication | 5864 - 5873 |
a | 10.0493 ± 0.0007 Å |
b | 18.5861 ± 0.0013 Å |
c | 19.4484 ± 0.0013 Å |
α | 101.466 ± 0.002° |
β | 104.309 ± 0.002° |
γ | 103.074 ± 0.002° |
Cell volume | 3301.4 ± 0.4 Å3 |
Cell temperature | 120 K |
Ambient diffraction temperature | 120 K |
Number of distinct elements | 5 |
Space group number | 2 |
Hermann-Mauguin space group symbol | P -1 |
Hall space group symbol | -P 1 |
Residual factor for all reflections | 0.0607 |
Residual factor for significantly intense reflections | 0.0393 |
Weighted residual factors for significantly intense reflections | 0.0936 |
Weighted residual factors for all reflections included in the refinement | 0.1024 |
Goodness-of-fit parameter for all reflections included in the refinement | 1.027 |
Diffraction radiation probe | x-ray |
Diffraction radiation wavelength | 0.71073 Å |
Diffraction radiation type | MoKα |