Information card for entry 4343106
Formula | C40 H38 F16 Ir N4 P S2 |
Calculated formula | C40 H38 F16 Ir N4 P S2 |
SMILES | [Ir]123([n]4c(cccc4)c4c2cc(S(F)(F)(F)(F)F)cc4)([n]2c(cccc2)c2c3cc(S(F)(F)(F)(F)F)cc2)[n]2c(cc(cc2)C(C)(C)C)c2[n]1ccc(c2)C(C)(C)C.[P](F)(F)(F)(F)(F)[F-] |
Title of publication | Green Phosphorescence and Electroluminescence of Sulfur Pentafluoride-Functionalized Cationic Iridium(III) Complexes. |
Authors of publication | Shavaleev, Nail M.; Xie, Guohua; Varghese, Shinto; Cordes, David B.; Slawin, Alexandra M. Z.; Momblona, Cristina; Ortí, Enrique; Bolink, Henk J.; Samuel, Ifor D. W.; Zysman-Colman, Eli |
Journal of publication | Inorganic chemistry |
Year of publication | 2015 |
Journal volume | 54 |
Journal issue | 12 |
Pages of publication | 5907 - 5914 |
a | 12.3161 ± 0.0013 Å |
b | 27.969 ± 0.003 Å |
c | 14.5941 ± 0.0017 Å |
α | 90° |
β | 113.289 ± 0.002° |
γ | 90° |
Cell volume | 4617.6 ± 0.9 Å3 |
Cell temperature | 173 K |
Ambient diffraction temperature | 173 K |
Number of distinct elements | 7 |
Space group number | 14 |
Hermann-Mauguin space group symbol | P 1 21/c 1 |
Hall space group symbol | -P 2ybc |
Residual factor for all reflections | 0.042 |
Residual factor for significantly intense reflections | 0.0366 |
Weighted residual factors for significantly intense reflections | 0.1155 |
Weighted residual factors for all reflections included in the refinement | 0.1172 |
Goodness-of-fit parameter for all reflections included in the refinement | 1.05 |
Diffraction radiation wavelength | 0.71075 Å |
Diffraction radiation type | MoKα |