Information card for entry 4343114
Formula | C36 H46 Mg2 N4 O17 |
Calculated formula | C36 H42 Mg2 N4 O17 |
Title of publication | Alkaline Earth Metal Ion/Dihydroxy-Terephthalate MOFs: Structural Diversity and Unusual Luminescent Properties. |
Authors of publication | Douvali, Antigoni; Papaefstathiou, Giannis S.; Gullo, Maria Pia; Barbieri, Andrea; Tsipis, Athanassios C.; Malliakas, Christos D.; Kanatzidis, Mercouri G.; Papadas, Ioannis; Armatas, Gerasimos S.; Hatzidimitriou, Antonios G.; Lazarides, Theodore; Manos, Manolis J. |
Journal of publication | Inorganic chemistry |
Year of publication | 2015 |
Journal volume | 54 |
Journal issue | 12 |
Pages of publication | 5813 - 5826 |
a | 11.993 ± 0.002 Å |
b | 19.632 ± 0.004 Å |
c | 18.143 ± 0.004 Å |
α | 90° |
β | 102.06 ± 0.03° |
γ | 90° |
Cell volume | 4177.4 ± 1.5 Å3 |
Cell temperature | 293 ± 2 K |
Ambient diffraction temperature | 293 ± 2 K |
Number of distinct elements | 5 |
Space group number | 15 |
Hermann-Mauguin space group symbol | C 1 2/c 1 |
Hall space group symbol | -C 2yc |
Residual factor for all reflections | 0.099 |
Residual factor for significantly intense reflections | 0.0692 |
Weighted residual factors for significantly intense reflections | 0.1582 |
Weighted residual factors for all reflections included in the refinement | 0.1716 |
Goodness-of-fit parameter for all reflections included in the refinement | 1.092 |
Diffraction radiation wavelength | 0.71073 Å |
Diffraction radiation type | MoKα |