Information card for entry 4343126
Formula | C304 H366 Cl4 Dy4 N8 Na4 Ni24 O74 S24 |
Calculated formula | C303.84 H299.88 Cl3.96 Dy3.98 N12 Ni24 O69.92 S24 |
Title of publication | Stepwise construction of extra-large heterometallic calixarene-based cages. |
Authors of publication | Su, Kongzhao; Jiang, Feilong; Qian, Jinjie; Chen, Lian; Pang, Jiandong; Bawaked, Salem M.; Mokhtar, Mohamed; Al-Thabaiti, Shaeel A; Hong, Maochun |
Journal of publication | Inorganic chemistry |
Year of publication | 2015 |
Journal volume | 54 |
Journal issue | 7 |
Pages of publication | 3183 - 3188 |
a | 23.4172 ± 0.0001 Å |
b | 23.4172 ± 0.0001 Å |
c | 70.1696 ± 0.0003 Å |
α | 90° |
β | 90° |
γ | 120° |
Cell volume | 33323.4 ± 0.2 Å3 |
Cell temperature | 100 ± 2 K |
Ambient diffraction temperature | 100 ± 2 K |
Number of distinct elements | 9 |
Space group number | 176 |
Hermann-Mauguin space group symbol | P 63/m |
Hall space group symbol | -P 6c |
Residual factor for all reflections | 0.0839 |
Residual factor for significantly intense reflections | 0.0766 |
Weighted residual factors for significantly intense reflections | 0.2157 |
Weighted residual factors for all reflections included in the refinement | 0.2235 |
Goodness-of-fit parameter for all reflections included in the refinement | 1.094 |
Diffraction radiation wavelength | 1.54184 Å |
Diffraction radiation type | CuKα |