Information card for entry 4343177
Formula | C34 H45 B Cd N6 O S4 |
Calculated formula | C34 H45 B Cd N6 O S4 |
SMILES | [Cd]12([S]=C3N([BH](N4C(=[S]1)N(C=C4)C(C)(C)C)N1C(=[S]2)N(C=C1)C(C)(C)C)C=CN3C(C)(C)C)SC(=O)c1ccccc1.c1ccccc1 |
Title of publication | Synthesis and Structures of Cadmium Carboxylate and Thiocarboxylate Compounds with a Sulfur-Rich Coordination Environment: Carboxylate Exchange Kinetics Involving Tris(2-mercapto-1-t-butylimidazolyl)hydroborato Cadmium Complexes, [Tm(Bu(t))]Cd(O2CR). |
Authors of publication | Kreider-Mueller, Ava; Quinlivan, Patrick J.; Owen, Jonathan S.; Parkin, Gerard |
Journal of publication | Inorganic chemistry |
Year of publication | 2015 |
Journal volume | 54 |
Journal issue | 8 |
Pages of publication | 3835 - 3850 |
a | 10.6011 ± 0.0015 Å |
b | 11.0621 ± 0.0016 Å |
c | 15.95 ± 0.002 Å |
α | 87.14 ± 0.002° |
β | 87.683 ± 0.002° |
γ | 86.158 ± 0.002° |
Cell volume | 1862.6 ± 0.4 Å3 |
Cell temperature | 150 ± 2 K |
Ambient diffraction temperature | 150 ± 2 K |
Number of distinct elements | 7 |
Space group number | 2 |
Hermann-Mauguin space group symbol | P -1 |
Hall space group symbol | -P 1 |
Residual factor for all reflections | 0.0749 |
Residual factor for significantly intense reflections | 0.0447 |
Weighted residual factors for significantly intense reflections | 0.0807 |
Weighted residual factors for all reflections included in the refinement | 0.0909 |
Goodness-of-fit parameter for all reflections included in the refinement | 1.013 |
Diffraction radiation wavelength | 0.71073 Å |
Diffraction radiation type | MoKα |