Information card for entry 4343199
Formula | C89.5 H80 Cu4 I4 P4 |
Calculated formula | C72 H60 Cu4 I4 P4 |
SMILES | [I]12[Cu]3456([I]7[Cu]8914([I]1[Cu]4258([I]3[Cu]67914[P](c1ccccc1)(c1ccccc1)c1ccccc1)[P](c1ccccc1)(c1ccccc1)c1ccccc1)[P](c1ccccc1)(c1ccccc1)c1ccccc1)[P](c1ccccc1)(c1ccccc1)c1ccccc1 |
Title of publication | Geometry flexibility of copper iodide clusters: variability in luminescence thermochromism. |
Authors of publication | Benito, Quentin; Goff, Xavier F Le; Nocton, Gregory; Fargues, Alexandre; Garcia, Alain; Berhault, Aurélie; Kahlal, Samia; Saillard, Jean-Yves; Martineau, Charlotte; Trébosc, Julien; Gacoin, Thierry; Boilot, Jean-Pierre; Perruchas, Sandrine |
Journal of publication | Inorganic chemistry |
Year of publication | 2015 |
Journal volume | 54 |
Journal issue | 9 |
Pages of publication | 4483 - 4494 |
a | 15.0544 ± 0.0003 Å |
b | 12.6018 ± 0.0002 Å |
c | 44.1431 ± 0.0007 Å |
α | 90° |
β | 92.512 ± 0.001° |
γ | 90° |
Cell volume | 8366.5 ± 0.3 Å3 |
Cell temperature | 250 ± 2 K |
Ambient diffraction temperature | 250 ± 2 K |
Number of distinct elements | 5 |
Space group number | 14 |
Hermann-Mauguin space group symbol | P 1 21/c 1 |
Hall space group symbol | -P 2ybc |
Residual factor for all reflections | 0.0442 |
Residual factor for significantly intense reflections | 0.0369 |
Weighted residual factors for significantly intense reflections | 0.0876 |
Weighted residual factors for all reflections included in the refinement | 0.0969 |
Goodness-of-fit parameter for all reflections included in the refinement | 1.003 |
Diffraction radiation probe | x-ray |
Diffraction radiation wavelength | 0.71073 Å |
Diffraction radiation type | MoKα |