Information card for entry 4343212
Chemical name | dichloro(bis(triphenylphosphine))dithiocarboxytriphenylphophine)ruthenium(II) |
Formula | C57 H47 Cl2 P3 Ru S2.5 |
Calculated formula | C57 H47 Cl2 P3 Ru S2.5 |
Title of publication | Formation of a Stable Complex, RuCl2(S2CPPh3)(PPh3)2, Containing an Unstable Zwitterion from the Reaction of RuCl2(PPh3)3 with Carbon Disulfide. |
Authors of publication | Ghiassi, Kamran B.; Walters, Daniel T.; Aristov, Michael M.; Loewen, Natalia D.; Berben, Louise A.; Rivera, Melissa; Olmstead, Marilyn M.; Balch, Alan L. |
Journal of publication | Inorganic chemistry |
Year of publication | 2015 |
Journal volume | 54 |
Journal issue | 9 |
Pages of publication | 4565 - 4573 |
a | 12.872 ± 0.003 Å |
b | 13.089 ± 0.003 Å |
c | 17.688 ± 0.004 Å |
α | 73.54 ± 0.004° |
β | 68.684 ± 0.004° |
γ | 62.494 ± 0.003° |
Cell volume | 2438.3 ± 1 Å3 |
Cell temperature | 90 ± 2 K |
Ambient diffraction temperature | 90 ± 2 K |
Number of distinct elements | 6 |
Space group number | 2 |
Hermann-Mauguin space group symbol | P -1 |
Hall space group symbol | -P 1 |
Residual factor for all reflections | 0.0571 |
Residual factor for significantly intense reflections | 0.0393 |
Weighted residual factors for significantly intense reflections | 0.0901 |
Weighted residual factors for all reflections included in the refinement | 0.0961 |
Goodness-of-fit parameter for all reflections included in the refinement | 0.977 |
Diffraction radiation wavelength | 0.71073 Å |
Diffraction radiation type | MoKα |