Information card for entry 4343215
Common name | dimer1 |
Formula | C30 N4 O19 U2 |
Calculated formula | C30 N4 O19 U2 |
Title of publication | Cation templating and electronic structure effects in uranyl cage clusters probed by the isolation of peroxide-bridged uranyl dimers. |
Authors of publication | Qiu, Jie; Vlaisavljevich, Bess; Jouffret, Laurent; Nguyen, Kevin; Szymanowski, Jennifer E. S.; Gagliardi, Laura; Burns, Peter C. |
Journal of publication | Inorganic chemistry |
Year of publication | 2015 |
Journal volume | 54 |
Journal issue | 9 |
Pages of publication | 4445 - 4455 |
a | 8.4681 ± 0.0008 Å |
b | 42.973 ± 0.004 Å |
c | 12.5165 ± 0.0013 Å |
α | 90° |
β | 106.739 ± 0.001° |
γ | 90° |
Cell volume | 4361.8 ± 0.7 Å3 |
Cell temperature | 100 ± 2 K |
Ambient diffraction temperature | 100 ± 2 K |
Number of distinct elements | 4 |
Space group number | 9 |
Hermann-Mauguin space group symbol | C 1 c 1 |
Hall space group symbol | C -2yc |
Residual factor for all reflections | 0.0541 |
Residual factor for significantly intense reflections | 0.0461 |
Weighted residual factors for significantly intense reflections | 0.1112 |
Weighted residual factors for all reflections included in the refinement | 0.1178 |
Goodness-of-fit parameter for all reflections included in the refinement | 1.028 |
Diffraction radiation wavelength | 0.71073 Å |
Diffraction radiation type | MoKα |